{"text_format":"1","workbook":"xlsx","n_sheets":4,"sheets":["Foglio1","Charting","Table","Plotting pos of raw data points"],"not_rendered":{"charts":1,"images":0,"macros":1,"external_links":0,"defined_names":0,"comments":2,"pivot_tables":0},"unopened":[],"bounds":{"document_bytes":16777216,"sheet_cells":100000,"rows_first":2000,"rows_last":500,"rows_between":2000,"halvings":0,"cell_chars":16384,"cell_head_chars":4096},"cells_cut":0,"cells_raw":0,"read":"whole","date_system":"1900"}

{"sheet":"Foglio1","index":0,"n_rows":154,"n_cols":19,"rows_kept":154,"cut":false,"hidden":false,"merged":[]}
["user_Country","user_Affiliation","user_Age","user_id","date","question","subquestion","labels","Platform on which software developers can learn","Means to train quantum engineers","Unknown yet","Other known educational value","Cat5","Cat6","Cat7","Cat8","Cat9","Others","explanation"]
["Germany","Fraunhofer",29,"5852c089aef2c94c3a000367","2017/3/31 12:17:16",14,1,"Educational value"]
["United Kingdom","University of Sussex",45,"5852c089aef2c94c3a00036b","2017/5/4 10:41:57",14,1,"Educational value",100,100,null,100,null,null,null,null,null,"General training in STEM subjects."]
["Netherlands","Atos",29,"5852c089aef2c94c3a00036d","2017/5/5 12:23:20",14,1,"Educational value",85,85,0]
["Switzerland","IBM Zurich Research Laboratory",55,"5852c089aef2c94c3a00036f","2017/4/21 17:31:5",14,1,"Educational value",80,100,0,null,null,null,null,null,null,null,"People learn the basics at university- but they are not well aware of quantum computing and its opportunities."]
["Italy","CNR - SPIN",47,"5852c089aef2c94c3a000373","2017/4/24 10:34:0",14,1,"Educational value",40,75,75]
["United Kingdom","Hitachi",null,"5852c089aef2c94c3a00037f","2017/4/21 9:4:13",14,1,"Educational value",70,90,30]
["United Kingdom","University of Oxford",null,"5852c089aef2c94c3a000385","2017/5/12 16:42:13",14,1,"Educational value",80,80,null,null,null,null,null,null,null,"I suspect that until/if there is a reasonable scale QC- small scale will only give a very basic training platform. But it might be useful for people to learn about Qubits etc.","I'm guessing here - if you want to find out- a better way would be to do a survey of these different groups. I suspect that most of these are aware of QC- but probably not of the potential or anything much about it."]
{"$rows_left_out":147}
{"sheet":"Charting","index":1,"n_rows":130,"n_cols":23,"rows_kept":130,"cut":false,"hidden":false,"merged":[]}
[{"$f":"Foglio1!$Q$1","v":"Cat9"},{"$f":"Foglio1!$P$1","v":"Cat8"},{"$f":"Foglio1!$O$1","v":"Cat7"},{"$f":"Foglio1!$N$1","v":"Cat6"},{"$f":"Foglio1!$M$1","v":"Cat5"},{"$f":"Foglio1!$L$1","v":"Other known educational value"},{"$f":"Foglio1!$K$1","v":"Unknown yet"},{"$f":"Foglio1!$J$1","v":"Means to train quantum engineers"},{"$f":"Foglio1!$I$1","v":"Platform on which software developers can learn"},null,null,null,"Bin size","Counts in bin:",{"$f":"Foglio1!Q1","v":"Cat9"},{"$f":"Foglio1!P1","v":"Cat8"},{"$f":"Foglio1!O1","v":"Cat7"},{"$f":"Foglio1!N1","v":"Cat6"},{"$f":"Foglio1!M1","v":"Cat5"},{"$f":"Foglio1!L1","v":"Other known educational value"},{"$f":"Foglio1!K1","v":"Unknown yet"},{"$f":"Foglio1!J1","v":"Means to train quantum engineers"},{"$f":"Foglio1!I1","v":"Platform on which software developers can learn"}]
[{"$f":"$M$2*INT('Plotting pos of raw data points'!I2/$M$2)","v":-20},{"$f":"$M$2*INT('Plotting pos of raw data points'!H2/$M$2)","v":-20},{"$f":"$M$2*INT('Plotting pos of raw data points'!G2/$M$2)","v":-20},{"$f":"$M$2*INT('Plotting pos of raw data points'!F2/$M$2)","v":-20},{"$f":"$M$2*INT('Plotting pos of raw data points'!E2/$M$2)","v":-20},{"$f":"$M$2*INT('Plotting pos of raw data points'!D2/$M$2)","v":-20},{"$f":"$M$2*INT('Plotting pos of raw data points'!C2/$M$2)","v":-20},{"$f":"$M$2*INT('Plotting pos of raw data points'!B2/$M$2)","v":-20},{"$f":"$M$2*INT('Plotting pos of raw data points'!A2/$M$2)","v":-20},null,null,null,20,"No answer given",{"$f":"COUNTIF(#REF!,\"<0\")","v":{"$error":"#REF!"}},{"$f":"COUNTIF(#REF!,\"<0\")","v":{"$error":"#REF!"}},{"$f":"COUNTIF(C:C,\"<0\")","v":99},99,99,93,59,28,27]
[{"$f":"$M$2*INT('Plotting pos of raw data points'!I3/$M$2)","v":-20},{"$f":"$M$2*INT('Plotting pos of raw data points'!H3/$M$2)","v":-20},{"$f":"$M$2*INT('Plotting pos of raw data points'!G3/$M$2)","v":-20},{"$f":"$M$2*INT('Plotting pos of raw data points'!F3/$M$2)","v":-20},{"$f":"$M$2*INT('Plotting pos of raw data points'!E3/$M$2)","v":-20},{"$f":"$M$2*INT('Plotting pos of raw data points'!D3/$M$2)","v":100},{"$f":"$M$2*INT('Plotting pos of raw data points'!C3/$M$2)","v":-20},{"$f":"$M$2*INT('Plotting pos of raw data points'!B3/$M$2)","v":100},{"$f":"$M$2*INT('Plotting pos of raw data points'!A3/$M$2)","v":100},null,null,null,"Scale",0,{"$f":"COUNTIF(#REF!,\"=\"&$N3)","v":{"$error":"#REF!"}},{"$f":"COUNTIF(#REF!,\"=\"&$N3)","v":{"$error":"#REF!"}},{"$f":"COUNTIF(C:C,\"=\"&$N3)","v":0},0,0,3,6,0,2]
[{"$f":"$M$2*INT('Plotting pos of raw data points'!I4/$M$2)","v":-20},{"$f":"$M$2*INT('Plotting pos of raw data points'!H4/$M$2)","v":-20},{"$f":"$M$2*INT('Plotting pos of raw data points'!G4/$M$2)","v":-20},{"$f":"$M$2*INT('Plotting pos of raw data points'!F4/$M$2)","v":-20},{"$f":"$M$2*INT('Plotting pos of raw data points'!E4/$M$2)","v":-20},{"$f":"$M$2*INT('Plotting pos of raw data points'!D4/$M$2)","v":-20},{"$f":"$M$2*INT('Plotting pos of raw data points'!C4/$M$2)","v":0},{"$f":"$M$2*INT('Plotting pos of raw data points'!B4/$M$2)","v":80},{"$f":"$M$2*INT('Plotting pos of raw data points'!A4/$M$2)","v":80},null,null,null,60,20,{"$f":"COUNTIF(#REF!,\"=\"&$N4)","v":{"$error":"#REF!"}},{"$f":"COUNTIF(#REF!,\"=\"&$N4)","v":{"$error":"#REF!"}},0,0,0,0,6,0,4]
[{"$f":"$M$2*INT('Plotting pos of raw data points'!I5/$M$2)","v":-20},{"$f":"$M$2*INT('Plotting pos of raw data points'!H5/$M$2)","v":-20},{"$f":"$M$2*INT('Plotting pos of raw data points'!G5/$M$2)","v":-20},{"$f":"$M$2*INT('Plotting pos of raw data points'!F5/$M$2)","v":-20},{"$f":"$M$2*INT('Plotting pos of raw data points'!E5/$M$2)","v":-20},{"$f":"$M$2*INT('Plotting pos of raw data points'!D5/$M$2)","v":-20},{"$f":"$M$2*INT('Plotting pos of raw data points'!C5/$M$2)","v":0},{"$f":"$M$2*INT('Plotting pos of raw data points'!B5/$M$2)","v":100},{"$f":"$M$2*INT('Plotting pos of raw data points'!A5/$M$2)","v":80},null,null,null,null,40,{"$f":"COUNTIF(#REF!,\"=\"&$N5)","v":{"$error":"#REF!"}},{"$f":"COUNTIF(#REF!,\"=\"&$N5)","v":{"$error":"#REF!"}},0,0,0,1,3,6,10]
[{"$f":"$M$2*INT('Plotting pos of raw data points'!I6/$M$2)","v":-20},{"$f":"$M$2*INT('Plotting pos of raw data points'!H6/$M$2)","v":-20},{"$f":"$M$2*INT('Plotting pos of raw data points'!G6/$M$2)","v":-20},{"$f":"$M$2*INT('Plotting pos of raw data points'!F6/$M$2)","v":-20},{"$f":"$M$2*INT('Plotting pos of raw data points'!E6/$M$2)","v":-20},{"$f":"$M$2*INT('Plotting pos of raw data points'!D6/$M$2)","v":-20},{"$f":"$M$2*INT('Plotting pos of raw data points'!C6/$M$2)","v":60},{"$f":"$M$2*INT('Plotting pos of raw data points'!B6/$M$2)","v":60},{"$f":"$M$2*INT('Plotting pos of raw data points'!A6/$M$2)","v":40},null,null,null,"Total number of respondents to question",60,{"$f":"COUNTIF(#REF!,\"=\"&$N6)","v":{"$error":"#REF!"}},{"$f":"COUNTIF(#REF!,\"=\"&$N6)","v":{"$error":"#REF!"}},0,0,0,1,14,14,19]
[{"$f":"$M$2*INT('Plotting pos of raw data points'!I7/$M$2)","v":-20},{"$f":"$M$2*INT('Plotting pos of raw data points'!H7/$M$2)","v":-20},{"$f":"$M$2*INT('Plotting pos of raw data points'!G7/$M$2)","v":-20},{"$f":"$M$2*INT('Plotting pos of raw data points'!F7/$M$2)","v":-20},{"$f":"$M$2*INT('Plotting pos of raw data points'!E7/$M$2)","v":-20},{"$f":"$M$2*INT('Plotting pos of raw data points'!D7/$M$2)","v":-20},{"$f":"$M$2*INT('Plotting pos of raw data points'!C7/$M$2)","v":20},{"$f":"$M$2*INT('Plotting pos of raw data points'!B7/$M$2)","v":80},{"$f":"$M$2*INT('Plotting pos of raw data points'!A7/$M$2)","v":60},null,null,null,{"$f":"COUNTA(Foglio1!$D$2:$D$1002)","v":99},80,{"$f":"COUNTIF(#REF!,\"=\"&$N7)","v":{"$error":"#REF!"}},{"$f":"COUNTIF(#REF!,\"=\"&$N7)","v":{"$error":"#REF!"}},0,0,0,0,7,32,27]
[{"$f":"$M$2*INT('Plotting pos of raw data points'!I8/$M$2)","v":-20},{"$f":"$M$2*INT('Plotting pos of raw data points'!H8/$M$2)","v":-20},{"$f":"$M$2*INT('Plotting pos of raw data points'!G8/$M$2)","v":-20},{"$f":"$M$2*INT('Plotting pos of raw data points'!F8/$M$2)","v":-20},{"$f":"$M$2*INT('Plotting pos of raw data points'!E8/$M$2)","v":-20},{"$f":"$M$2*INT('Plotting pos of raw data points'!D8/$M$2)","v":-20},{"$f":"$M$2*INT('Plotting pos of raw data points'!C8/$M$2)","v":-20},{"$f":"$M$2*INT('Plotting pos of raw data points'!B8/$M$2)","v":80},{"$f":"$M$2*INT('Plotting pos of raw data points'!A8/$M$2)","v":80},null,null,null,"Number of histograms",100,{"$f":"COUNTIF(#REF!,\"=\"&$N8)","v":{"$error":"#REF!"}},{"$f":"COUNTIF(#REF!,\"=\"&$N8)","v":{"$error":"#REF!"}},0,0,0,1,4,19,10]
{"$rows_left_out":123}
{"sheet":"Table","index":2,"n_rows":29,"n_cols":10,"rows_kept":29,"cut":false,"hidden":false,"merged":[]}
[null,{"$f":"Foglio1!I$1","v":"Platform on which software developers can learn"},{"$f":"Foglio1!J$1","v":"Means to train quantum engineers"},{"$f":"Foglio1!K$1","v":"Unknown yet"},{"$f":"Foglio1!L$1","v":"Other known educational value"},{"$f":"Foglio1!M$1","v":"Cat5"},{"$f":"Foglio1!N$1","v":"Cat6"},{"$f":"Foglio1!O$1","v":"Cat7"},{"$f":"Foglio1!P$1","v":"Cat8"},{"$f":"Foglio1!Q$1","v":"Cat9"}]
["MODA",{"$f":"MODE(OFFSET(Foglio1!I$2,0,0,$B$11,1))","v":80},{"$f":"MODE(OFFSET(Foglio1!J$2,0,0,$B$11,1))","v":100},{"$f":"MODE(OFFSET(Foglio1!K$2,0,0,$B$11,1))","v":60},{"$f":"MODE(OFFSET(Foglio1!L$2,0,0,$B$11,1))","v":0},{"$f":"MODE(OFFSET(Foglio1!R$2,0,0,$B$11,1))","v":{"$error":"#N/A"}},{"$f":"MODE(OFFSET(Foglio1!S$2,0,0,$B$11,1))","v":{"$error":"#N/A"}},{"$f":"MODE(OFFSET(Foglio1!O$2,0,0,$B$11,1))","v":{"$error":"#N/A"}},{"$f":"MODE(OFFSET(Foglio1!P$2,0,0,$B$11,1))","v":{"$error":"#N/A"}},{"$f":"MODE(OFFSET(Foglio1!Q$2,0,0,$B$11,1))","v":{"$error":"#N/A"}}]
["MEDIANA",{"$f":"MEDIAN(OFFSET(Foglio1!I$2,0,0,$B$11,1))","v":80},{"$f":"MEDIAN(OFFSET(Foglio1!J$2,0,0,$B$11,1))","v":80},{"$f":"MEDIAN(OFFSET(Foglio1!K$2,0,0,$B$11,1))","v":60},{"$f":"MEDIAN(OFFSET(Foglio1!L$2,0,0,$B$11,1))","v":25},{"$f":"MEDIAN(OFFSET(Foglio1!R$2,0,0,$B$11,1))","v":{"$error":"#NUM!"}},{"$f":"MEDIAN(OFFSET(Foglio1!S$2,0,0,$B$11,1))","v":{"$error":"#NUM!"}},{"$f":"MEDIAN(OFFSET(Foglio1!O$2,0,0,$B$11,1))","v":{"$error":"#NUM!"}},{"$f":"MEDIAN(OFFSET(Foglio1!P$2,0,0,$B$11,1))","v":{"$error":"#NUM!"}},{"$f":"MEDIAN(OFFSET(Foglio1!Q$2,0,0,$B$11,1))","v":{"$error":"#NUM!"}}]
["Q1",{"$f":"_xlfn.QUARTILE.EXC(OFFSET(Foglio1!I$2,0,0,$B$11,1),1)","v":60},{"$f":"_xlfn.QUARTILE.EXC(OFFSET(Foglio1!J$2,0,0,$B$11,1),1)","v":71},{"$f":"_xlfn.QUARTILE.EXC(OFFSET(Foglio1!K$2,0,0,$B$11,1),1)","v":30},{"$f":"_xlfn.QUARTILE.EXC(OFFSET(Foglio1!L$2,0,0,$B$11,1),1)","v":0},{"$f":"_xlfn.QUARTILE.EXC(OFFSET(Foglio1!R$2,0,0,$B$11,1),1)","v":{"$error":"#NUM!"}},{"$f":"_xlfn.QUARTILE.EXC(OFFSET(Foglio1!S$2,0,0,$B$11,1),1)","v":{"$error":"#NUM!"}},{"$f":"_xlfn.QUARTILE.EXC(OFFSET(Foglio1!O$2,0,0,$B$11,1),1)","v":{"$error":"#NUM!"}},{"$f":"_xlfn.QUARTILE.EXC(OFFSET(Foglio1!P$2,0,0,$B$11,1),1)","v":{"$error":"#NUM!"}},{"$f":"_xlfn.QUARTILE.EXC(OFFSET(Foglio1!Q$2,0,0,$B$11,1),1)","v":{"$error":"#NUM!"}}]
["Q3",{"$f":"_xlfn.QUARTILE.EXC(OFFSET(Foglio1!I$2,0,0,$B$11,1),3)","v":83.75},{"$f":"_xlfn.QUARTILE.EXC(OFFSET(Foglio1!J$2,0,0,$B$11,1),3)","v":100},{"$f":"_xlfn.QUARTILE.EXC(OFFSET(Foglio1!K$2,0,0,$B$11,1),3)","v":80},{"$f":"_xlfn.QUARTILE.EXC(OFFSET(Foglio1!L$2,0,0,$B$11,1),3)","v":70},{"$f":"_xlfn.QUARTILE.EXC(OFFSET(Foglio1!R$2,0,0,$B$11,1),3)","v":{"$error":"#NUM!"}},{"$f":"_xlfn.QUARTILE.EXC(OFFSET(Foglio1!S$2,0,0,$B$11,1),3)","v":{"$error":"#NUM!"}},{"$f":"_xlfn.QUARTILE.EXC(OFFSET(Foglio1!O$2,0,0,$B$11,1),3)","v":{"$error":"#NUM!"}},{"$f":"_xlfn.QUARTILE.EXC(OFFSET(Foglio1!P$2,0,0,$B$11,1),3)","v":{"$error":"#NUM!"}},{"$f":"_xlfn.QUARTILE.EXC(OFFSET(Foglio1!Q$2,0,0,$B$11,1),3)","v":{"$error":"#NUM!"}}]
["MEDIA",{"$f":"AVERAGE(OFFSET(Foglio1!I$2,0,0,$B$11,1))","v":71.152777777777771},{"$f":"AVERAGE(OFFSET(Foglio1!J$2,0,0,$B$11,1))","v":81.985915492957744},{"$f":"AVERAGE(OFFSET(Foglio1!K$2,0,0,$B$11,1))","v":54},{"$f":"AVERAGE(OFFSET(Foglio1!L$2,0,0,$B$11,1))","v":35},{"$f":"AVERAGE(OFFSET(Foglio1!R$2,0,0,$B$11,1))","v":{"$error":"#DIV/0!"}},{"$f":"AVERAGE(OFFSET(Foglio1!S$2,0,0,$B$11,1))","v":{"$error":"#DIV/0!"}},{"$f":"AVERAGE(OFFSET(Foglio1!O$2,0,0,$B$11,1))","v":{"$error":"#DIV/0!"}},{"$f":"AVERAGE(OFFSET(Foglio1!P$2,0,0,$B$11,1))","v":{"$error":"#DIV/0!"}},{"$f":"AVERAGE(OFFSET(Foglio1!Q$2,0,0,$B$11,1))","v":{"$error":"#DIV/0!"}}]
["MEDIA PESATA",{"$f":"SUMPRODUCT(OFFSET(Foglio1!I$2,0,0,$B$11,1),OFFSET(Foglio1!$X$2,0,0,$B$11,1))/SUM(OFFSET(Foglio1!$X$2,0,0,$B$11,1))","v":{"$error":"#DIV/0!"}},{"$f":"SUMPRODUCT(OFFSET(Foglio1!J$2,0,0,$B$11,1),OFFSET(Foglio1!$X$2,0,0,$B$11,1))/SUM(OFFSET(Foglio1!$X$2,0,0,$B$11,1))","v":{"$error":"#DIV/0!"}},{"$f":"SUMPRODUCT(OFFSET(Foglio1!K$2,0,0,$B$11,1),OFFSET(Foglio1!$X$2,0,0,$B$11,1))/SUM(OFFSET(Foglio1!$X$2,0,0,$B$11,1))","v":{"$error":"#DIV/0!"}},{"$f":"SUMPRODUCT(OFFSET(Foglio1!L$2,0,0,$B$11,1),OFFSET(Foglio1!$X$2,0,0,$B$11,1))/SUM(OFFSET(Foglio1!$X$2,0,0,$B$11,1))","v":{"$error":"#DIV/0!"}},{"$f":"SUMPRODUCT(OFFSET(Foglio1!R$2,0,0,$B$11,1),OFFSET(Foglio1!$X$2,0,0,$B$11,1))/SUM(OFFSET(Foglio1!$X$2,0,0,$B$11,1))","v":{"$error":"#DIV/0!"}},{"$f":"SUMPRODUCT(OFFSET(Foglio1!S$2,0,0,$B$11,1),OFFSET(Foglio1!$X$2,0,0,$B$11,1))/SUM(OFFSET(Foglio1!$X$2,0,0,$B$11,1))","v":{"$error":"#DIV/0!"}},{"$f":"SUMPRODUCT(OFFSET(Foglio1!O$2,0,0,$B$11,1),OFFSET(Foglio1!$X$2,0,0,$B$11,1))/SUM(OFFSET(Foglio1!$X$2,0,0,$B$11,1))","v":{"$error":"#DIV/0!"}},{"$f":"SUMPRODUCT(OFFSET(Foglio1!P$2,0,0,$B$11,1),OFFSET(Foglio1!$X$2,0,0,$B$11,1))/SUM(OFFSET(Foglio1!$X$2,0,0,$B$11,1))","v":{"$error":"#DIV/0!"}},{"$f":"SUMPRODUCT(OFFSET(Foglio1!Q$2,0,0,$B$11,1),OFFSET(Foglio1!$X$2,0,0,$B$11,1))/SUM(OFFSET(Foglio1!$X$2,0,0,$B$11,1))","v":{"$error":"#DIV/0!"}}]
[]
{"$rows_left_out":22}
{"sheet":"Plotting pos of raw data points","index":3,"n_rows":130,"n_cols":19,"rows_kept":130,"cut":false,"hidden":false,"merged":[]}
[{"$f":"Foglio1!I$1","v":"Platform on which software developers can learn"},{"$f":"Foglio1!J$1","v":"Means to train quantum engineers"},{"$f":"Foglio1!K$1","v":"Unknown yet"},{"$f":"Foglio1!L$1","v":"Other known educational value"},{"$f":"Foglio1!M$1","v":"Cat5"},{"$f":"Foglio1!N$1","v":"Cat6"},{"$f":"Foglio1!O$1","v":"Cat7"},{"$f":"Foglio1!P$1","v":"Cat8"},{"$f":"Foglio1!Q$1","v":"Cat9"},null,{"$f":"Charting!$M$9","v":3},{"$f":"K$1-1","v":2},{"$f":"L$1-1","v":1},0,-1,-2,-3,-4,-5]
[{"$f":"IF(ROW(A2)-1<=$J$5,IF(Foglio1!I2=\"\",-10,Foglio1!I2),\"\")","v":-10},{"$f":"IF(ROW(B2)-1<=$J$5,IF(Foglio1!J2=\"\",-10,Foglio1!J2),\"\")","v":-10},{"$f":"IF(ROW(C2)-1<=$J$5,IF(Foglio1!K2=\"\",-10,Foglio1!K2),\"\")","v":-10},{"$f":"IF(ROW(D2)-1<=$J$5,IF(Foglio1!L2=\"\",-10,Foglio1!L2),\"\")","v":-10},{"$f":"IF(ROW(E2)-1<=$J$5,IF(Foglio1!M2=\"\",-10,Foglio1!M2),\"\")","v":-10},{"$f":"IF(ROW(F2)-1<=$J$5,IF(Foglio1!N2=\"\",-10,Foglio1!N2),\"\")","v":-10},{"$f":"IF(ROW(G2)-1<=$J$5,IF(Foglio1!O2=\"\",-10,Foglio1!O2),\"\")","v":-10},{"$f":"IF(ROW(H2)-1<=$J$5,IF(Foglio1!P2=\"\",-10,Foglio1!P2),\"\")","v":-10},{"$f":"IF(ROW(I2)-1<=$J$5,IF(Foglio1!Q2=\"\",-10,Foglio1!Q2),\"\")","v":-10},null,{"$f":"IF(ROW(K2)-1<=$J$5,K$1+COUNTIF(A$2:A2,A2)*$J$7,\"\")","v":3.03},{"$f":"IF(ROW(L2)-1<=$J$5,L$1+COUNTIF(B$2:B2,B2)*$J$7,\"\")","v":2.0299999999999998},{"$f":"IF(ROW(M2)-1<=$J$5,M$1+COUNTIF(C$2:C2,C2)*$J$7,\"\")","v":1.03},{"$f":"IF(ROW(N2)-1<=$J$5,N$1+COUNTIF(D$2:D2,D2)*$J$7,\"\")","v":0.03},{"$f":"IF(ROW(O2)-1<=$J$5,O$1+COUNTIF(E$2:E2,E2)*$J$7,\"\")","v":-0.97},{"$f":"IF(ROW(P2)-1<=$J$5,P$1+COUNTIF(F$2:F2,F2)*$J$7,\"\")","v":-1.97},{"$f":"IF(ROW(Q2)-1<=$J$5,Q$1+COUNTIF(G$2:G2,G2)*$J$7,\"\")","v":-2.97},{"$f":"IF(ROW(R2)-1<=$J$5,R$1+COUNTIF(H$2:H2,H2)*$J$7,\"\")","v":-3.97},{"$f":"IF(ROW(S2)-1<=$J$5,S$1+COUNTIF(I$2:I2,I2)*$J$7,\"\")","v":-4.97}]
[{"$f":"IF(ROW(A3)-1<=$J$5,IF(Foglio1!I3=\"\",-10,Foglio1!I3),\"\")","v":100},{"$f":"IF(ROW(B3)-1<=$J$5,IF(Foglio1!J3=\"\",-10,Foglio1!J3),\"\")","v":100},{"$f":"IF(ROW(C3)-1<=$J$5,IF(Foglio1!K3=\"\",-10,Foglio1!K3),\"\")","v":-10},{"$f":"IF(ROW(D3)-1<=$J$5,IF(Foglio1!L3=\"\",-10,Foglio1!L3),\"\")","v":100},{"$f":"IF(ROW(E3)-1<=$J$5,IF(Foglio1!M3=\"\",-10,Foglio1!M3),\"\")","v":-10},{"$f":"IF(ROW(F3)-1<=$J$5,IF(Foglio1!N3=\"\",-10,Foglio1!N3),\"\")","v":-10},{"$f":"IF(ROW(G3)-1<=$J$5,IF(Foglio1!O3=\"\",-10,Foglio1!O3),\"\")","v":-10},{"$f":"IF(ROW(H3)-1<=$J$5,IF(Foglio1!P3=\"\",-10,Foglio1!P3),\"\")","v":-10},{"$f":"IF(ROW(I3)-1<=$J$5,IF(Foglio1!Q3=\"\",-10,Foglio1!Q3),\"\")","v":-10},null,{"$f":"IF(ROW(K3)-1<=$J$5,K$1+COUNTIF(A$2:A3,A3)*$J$7,\"\")","v":3.03},{"$f":"IF(ROW(L3)-1<=$J$5,L$1+COUNTIF(B$2:B3,B3)*$J$7,\"\")","v":2.0299999999999998},{"$f":"IF(ROW(M3)-1<=$J$5,M$1+COUNTIF(C$2:C3,C3)*$J$7,\"\")","v":1.06},{"$f":"IF(ROW(N3)-1<=$J$5,N$1+COUNTIF(D$2:D3,D3)*$J$7,\"\")","v":0.03},{"$f":"IF(ROW(O3)-1<=$J$5,O$1+COUNTIF(E$2:E3,E3)*$J$7,\"\")","v":-0.94},{"$f":"IF(ROW(P3)-1<=$J$5,P$1+COUNTIF(F$2:F3,F3)*$J$7,\"\")","v":-1.94},{"$f":"IF(ROW(Q3)-1<=$J$5,Q$1+COUNTIF(G$2:G3,G3)*$J$7,\"\")","v":-2.94},{"$f":"IF(ROW(R3)-1<=$J$5,R$1+COUNTIF(H$2:H3,H3)*$J$7,\"\")","v":-3.94},{"$f":"IF(ROW(S3)-1<=$J$5,S$1+COUNTIF(I$2:I3,I3)*$J$7,\"\")","v":-4.9400000000000004}]
[{"$f":"IF(ROW(A4)-1<=$J$5,IF(Foglio1!I4=\"\",-10,Foglio1!I4),\"\")","v":85},{"$f":"IF(ROW(B4)-1<=$J$5,IF(Foglio1!J4=\"\",-10,Foglio1!J4),\"\")","v":85},{"$f":"IF(ROW(C4)-1<=$J$5,IF(Foglio1!K4=\"\",-10,Foglio1!K4),\"\")","v":0},{"$f":"IF(ROW(D4)-1<=$J$5,IF(Foglio1!L4=\"\",-10,Foglio1!L4),\"\")","v":-10},{"$f":"IF(ROW(E4)-1<=$J$5,IF(Foglio1!M4=\"\",-10,Foglio1!M4),\"\")","v":-10},{"$f":"IF(ROW(F4)-1<=$J$5,IF(Foglio1!N4=\"\",-10,Foglio1!N4),\"\")","v":-10},{"$f":"IF(ROW(G4)-1<=$J$5,IF(Foglio1!O4=\"\",-10,Foglio1!O4),\"\")","v":-10},{"$f":"IF(ROW(H4)-1<=$J$5,IF(Foglio1!P4=\"\",-10,Foglio1!P4),\"\")","v":-10},{"$f":"IF(ROW(I4)-1<=$J$5,IF(Foglio1!Q4=\"\",-10,Foglio1!Q4),\"\")","v":-10},"Total number of respondents to question",{"$f":"IF(ROW(K4)-1<=$J$5,K$1+COUNTIF(A$2:A4,A4)*$J$7,\"\")","v":3.03},{"$f":"IF(ROW(L4)-1<=$J$5,L$1+COUNTIF(B$2:B4,B4)*$J$7,\"\")","v":2.0299999999999998},{"$f":"IF(ROW(M4)-1<=$J$5,M$1+COUNTIF(C$2:C4,C4)*$J$7,\"\")","v":1.03},{"$f":"IF(ROW(N4)-1<=$J$5,N$1+COUNTIF(D$2:D4,D4)*$J$7,\"\")","v":0.06},{"$f":"IF(ROW(O4)-1<=$J$5,O$1+COUNTIF(E$2:E4,E4)*$J$7,\"\")","v":-0.91},{"$f":"IF(ROW(P4)-1<=$J$5,P$1+COUNTIF(F$2:F4,F4)*$J$7,\"\")","v":-1.91},{"$f":"IF(ROW(Q4)-1<=$J$5,Q$1+COUNTIF(G$2:G4,G4)*$J$7,\"\")","v":-2.91},{"$f":"IF(ROW(R4)-1<=$J$5,R$1+COUNTIF(H$2:H4,H4)*$J$7,\"\")","v":-3.91},{"$f":"IF(ROW(S4)-1<=$J$5,S$1+COUNTIF(I$2:I4,I4)*$J$7,\"\")","v":-4.91}]
[{"$f":"IF(ROW(A5)-1<=$J$5,IF(Foglio1!I5=\"\",-10,Foglio1!I5),\"\")","v":80},{"$f":"IF(ROW(B5)-1<=$J$5,IF(Foglio1!J5=\"\",-10,Foglio1!J5),\"\")","v":100},{"$f":"IF(ROW(C5)-1<=$J$5,IF(Foglio1!K5=\"\",-10,Foglio1!K5),\"\")","v":0},{"$f":"IF(ROW(D5)-1<=$J$5,IF(Foglio1!L5=\"\",-10,Foglio1!L5),\"\")","v":-10},{"$f":"IF(ROW(E5)-1<=$J$5,IF(Foglio1!M5=\"\",-10,Foglio1!M5),\"\")","v":-10},{"$f":"IF(ROW(F5)-1<=$J$5,IF(Foglio1!N5=\"\",-10,Foglio1!N5),\"\")","v":-10},{"$f":"IF(ROW(G5)-1<=$J$5,IF(Foglio1!O5=\"\",-10,Foglio1!O5),\"\")","v":-10},{"$f":"IF(ROW(H5)-1<=$J$5,IF(Foglio1!P5=\"\",-10,Foglio1!P5),\"\")","v":-10},{"$f":"IF(ROW(I5)-1<=$J$5,IF(Foglio1!Q5=\"\",-10,Foglio1!Q5),\"\")","v":-10},{"$f":"COUNTA(Foglio1!D2:D529)","v":99},{"$f":"IF(ROW(K5)-1<=$J$5,K$1+COUNTIF(A$2:A5,A5)*$J$7,\"\")","v":3.03},{"$f":"IF(ROW(L5)-1<=$J$5,L$1+COUNTIF(B$2:B5,B5)*$J$7,\"\")","v":2.06},{"$f":"IF(ROW(M5)-1<=$J$5,M$1+COUNTIF(C$2:C5,C5)*$J$7,\"\")","v":1.06},{"$f":"IF(ROW(N5)-1<=$J$5,N$1+COUNTIF(D$2:D5,D5)*$J$7,\"\")","v":0.09},{"$f":"IF(ROW(O5)-1<=$J$5,O$1+COUNTIF(E$2:E5,E5)*$J$7,\"\")","v":-0.88},{"$f":"IF(ROW(P5)-1<=$J$5,P$1+COUNTIF(F$2:F5,F5)*$J$7,\"\")","v":-1.88},{"$f":"IF(ROW(Q5)-1<=$J$5,Q$1+COUNTIF(G$2:G5,G5)*$J$7,\"\")","v":-2.88},{"$f":"IF(ROW(R5)-1<=$J$5,R$1+COUNTIF(H$2:H5,H5)*$J$7,\"\")","v":-3.88},{"$f":"IF(ROW(S5)-1<=$J$5,S$1+COUNTIF(I$2:I5,I5)*$J$7,\"\")","v":-4.88}]
[{"$f":"IF(ROW(A6)-1<=$J$5,IF(Foglio1!I6=\"\",-10,Foglio1!I6),\"\")","v":40},{"$f":"IF(ROW(B6)-1<=$J$5,IF(Foglio1!J6=\"\",-10,Foglio1!J6),\"\")","v":75},{"$f":"IF(ROW(C6)-1<=$J$5,IF(Foglio1!K6=\"\",-10,Foglio1!K6),\"\")","v":75},{"$f":"IF(ROW(D6)-1<=$J$5,IF(Foglio1!L6=\"\",-10,Foglio1!L6),\"\")","v":-10},{"$f":"IF(ROW(E6)-1<=$J$5,IF(Foglio1!M6=\"\",-10,Foglio1!M6),\"\")","v":-10},{"$f":"IF(ROW(F6)-1<=$J$5,IF(Foglio1!N6=\"\",-10,Foglio1!N6),\"\")","v":-10},{"$f":"IF(ROW(G6)-1<=$J$5,IF(Foglio1!O6=\"\",-10,Foglio1!O6),\"\")","v":-10},{"$f":"IF(ROW(H6)-1<=$J$5,IF(Foglio1!P6=\"\",-10,Foglio1!P6),\"\")","v":-10},{"$f":"IF(ROW(I6)-1<=$J$5,IF(Foglio1!Q6=\"\",-10,Foglio1!Q6),\"\")","v":-10},"Compression",{"$f":"IF(ROW(K6)-1<=$J$5,K$1+COUNTIF(A$2:A6,A6)*$J$7,\"\")","v":3.03},{"$f":"IF(ROW(L6)-1<=$J$5,L$1+COUNTIF(B$2:B6,B6)*$J$7,\"\")","v":2.0299999999999998},{"$f":"IF(ROW(M6)-1<=$J$5,M$1+COUNTIF(C$2:C6,C6)*$J$7,\"\")","v":1.03},{"$f":"IF(ROW(N6)-1<=$J$5,N$1+COUNTIF(D$2:D6,D6)*$J$7,\"\")","v":0.12},{"$f":"IF(ROW(O6)-1<=$J$5,O$1+COUNTIF(E$2:E6,E6)*$J$7,\"\")","v":-0.85},{"$f":"IF(ROW(P6)-1<=$J$5,P$1+COUNTIF(F$2:F6,F6)*$J$7,\"\")","v":-1.85},{"$f":"IF(ROW(Q6)-1<=$J$5,Q$1+COUNTIF(G$2:G6,G6)*$J$7,\"\")","v":-2.85},{"$f":"IF(ROW(R6)-1<=$J$5,R$1+COUNTIF(H$2:H6,H6)*$J$7,\"\")","v":-3.85},{"$f":"IF(ROW(S6)-1<=$J$5,S$1+COUNTIF(I$2:I6,I6)*$J$7,\"\")","v":-4.8499999999999996}]
[{"$f":"IF(ROW(A7)-1<=$J$5,IF(Foglio1!I7=\"\",-10,Foglio1!I7),\"\")","v":70},{"$f":"IF(ROW(B7)-1<=$J$5,IF(Foglio1!J7=\"\",-10,Foglio1!J7),\"\")","v":90},{"$f":"IF(ROW(C7)-1<=$J$5,IF(Foglio1!K7=\"\",-10,Foglio1!K7),\"\")","v":30},{"$f":"IF(ROW(D7)-1<=$J$5,IF(Foglio1!L7=\"\",-10,Foglio1!L7),\"\")","v":-10},{"$f":"IF(ROW(E7)-1<=$J$5,IF(Foglio1!M7=\"\",-10,Foglio1!M7),\"\")","v":-10},{"$f":"IF(ROW(F7)-1<=$J$5,IF(Foglio1!N7=\"\",-10,Foglio1!N7),\"\")","v":-10},{"$f":"IF(ROW(G7)-1<=$J$5,IF(Foglio1!O7=\"\",-10,Foglio1!O7),\"\")","v":-10},{"$f":"IF(ROW(H7)-1<=$J$5,IF(Foglio1!P7=\"\",-10,Foglio1!P7),\"\")","v":-10},{"$f":"IF(ROW(I7)-1<=$J$5,IF(Foglio1!Q7=\"\",-10,Foglio1!Q7),\"\")","v":-10},0.03,{"$f":"IF(ROW(K7)-1<=$J$5,K$1+COUNTIF(A$2:A7,A7)*$J$7,\"\")","v":3.03},{"$f":"IF(ROW(L7)-1<=$J$5,L$1+COUNTIF(B$2:B7,B7)*$J$7,\"\")","v":2.0299999999999998},{"$f":"IF(ROW(M7)-1<=$J$5,M$1+COUNTIF(C$2:C7,C7)*$J$7,\"\")","v":1.03},{"$f":"IF(ROW(N7)-1<=$J$5,N$1+COUNTIF(D$2:D7,D7)*$J$7,\"\")","v":0.15},{"$f":"IF(ROW(O7)-1<=$J$5,O$1+COUNTIF(E$2:E7,E7)*$J$7,\"\")","v":-0.82000000000000006},{"$f":"IF(ROW(P7)-1<=$J$5,P$1+COUNTIF(F$2:F7,F7)*$J$7,\"\")","v":-1.82},{"$f":"IF(ROW(Q7)-1<=$J$5,Q$1+COUNTIF(G$2:G7,G7)*$J$7,\"\")","v":-2.82},{"$f":"IF(ROW(R7)-1<=$J$5,R$1+COUNTIF(H$2:H7,H7)*$J$7,\"\")","v":-3.82},{"$f":"IF(ROW(S7)-1<=$J$5,S$1+COUNTIF(I$2:I7,I7)*$J$7,\"\")","v":-4.82}]
[{"$f":"IF(ROW(A8)-1<=$J$5,IF(Foglio1!I8=\"\",-10,Foglio1!I8),\"\")","v":80},{"$f":"IF(ROW(B8)-1<=$J$5,IF(Foglio1!J8=\"\",-10,Foglio1!J8),\"\")","v":80},{"$f":"IF(ROW(C8)-1<=$J$5,IF(Foglio1!K8=\"\",-10,Foglio1!K8),\"\")","v":-10},{"$f":"IF(ROW(D8)-1<=$J$5,IF(Foglio1!L8=\"\",-10,Foglio1!L8),\"\")","v":-10},{"$f":"IF(ROW(E8)-1<=$J$5,IF(Foglio1!M8=\"\",-10,Foglio1!M8),\"\")","v":-10},{"$f":"IF(ROW(F8)-1<=$J$5,IF(Foglio1!N8=\"\",-10,Foglio1!N8),\"\")","v":-10},{"$f":"IF(ROW(G8)-1<=$J$5,IF(Foglio1!O8=\"\",-10,Foglio1!O8),\"\")","v":-10},{"$f":"IF(ROW(H8)-1<=$J$5,IF(Foglio1!P8=\"\",-10,Foglio1!P8),\"\")","v":-10},{"$f":"IF(ROW(I8)-1<=$J$5,IF(Foglio1!Q8=\"\",-10,Foglio1!Q8),\"\")","v":-10},null,{"$f":"IF(ROW(K8)-1<=$J$5,K$1+COUNTIF(A$2:A8,A8)*$J$7,\"\")","v":3.06},{"$f":"IF(ROW(L8)-1<=$J$5,L$1+COUNTIF(B$2:B8,B8)*$J$7,\"\")","v":2.0299999999999998},{"$f":"IF(ROW(M8)-1<=$J$5,M$1+COUNTIF(C$2:C8,C8)*$J$7,\"\")","v":1.0900000000000001},{"$f":"IF(ROW(N8)-1<=$J$5,N$1+COUNTIF(D$2:D8,D8)*$J$7,\"\")","v":0.18},{"$f":"IF(ROW(O8)-1<=$J$5,O$1+COUNTIF(E$2:E8,E8)*$J$7,\"\")","v":-0.79},{"$f":"IF(ROW(P8)-1<=$J$5,P$1+COUNTIF(F$2:F8,F8)*$J$7,\"\")","v":-1.79},{"$f":"IF(ROW(Q8)-1<=$J$5,Q$1+COUNTIF(G$2:G8,G8)*$J$7,\"\")","v":-2.79},{"$f":"IF(ROW(R8)-1<=$J$5,R$1+COUNTIF(H$2:H8,H8)*$J$7,\"\")","v":-3.79},{"$f":"IF(ROW(S8)-1<=$J$5,S$1+COUNTIF(I$2:I8,I8)*$J$7,\"\")","v":-4.79}]
{"$rows_left_out":122}